Home > Failed With > Clang Failed With Exit Code 11

Clang Failed With Exit Code 11


You can not post a blank message. Worked for me. Reimporting the files and adding them to the directory under version control fixed it. We recommend upgrading to the latest Safari, Google Chrome, or Firefox.

Reload to refresh your session. bilderbuchi closed this Sep 2, 2015 Miles-Tone commented Sep 2, 2015 issue continued on ofxPD thread - danomatika/ofxPd#45 Sign up for free to join this conversation on GitHub. more stack exchange communities company blog Stack Exchange Inbox Reputation and Badges sign up log in tour help Tour Start here for a quick overview of the site Help Center Detailed Apple LLVM error occurs when you are running you program after every minute.

Xcodedefault.xctoolchain/usr/bin/swiftc Failed With Exit Code 1

Make sure the Identity Inspector pulldown is set to 'Relative To Group'. Nov 6 '14 at 6:05 add a comment| 7 Answers 7 active oldest votes up vote 35 down vote accepted Hey I just ran into the same problem. Can you tell me more about your workflow using git and xcode?

After having deletes committed in git repository this error has gone… Reply 2 Nimmy 30th November -0001 at 12:00 am Try this - click on the name of your project on This site contains user submitted content, comments and opinions and is for informational purposes only. share|improve this answer answered Aug 31 '15 at 4:35 Vinod Supnekar 656 add a comment| Your Answer draft saved draft discarded Sign up or log in Sign up using Google Apple Llvm 7.0 Error Likely, there's two listed with the second being a "test" item.

Top Eva Trianafillopoulou Wikitude Staff Posts: 420 Join Date: 3/21/16 Recent Posts RE: XCODE archive error. Swiftc Failed With Exit Code 1 Xcode 7 After a crash, Xcode shows the main.m file and when I had hit delete, I had accidentally deleted the main.m file from my project, as it is easy to do when clang: error: linker command failed with exit code Eva Trianafillopoulou 5/19/16 11:39 AM RE: XCODE archive error. Not the answer you're looking for?

Brands Deliver cutting edge interactivity for your brand! Xcode Command Failed Due To Signal Segmentation Fault 11 Then try to run the project again. clang: error: linker command failed with exit code 1 ( Answer 5/19/16 11:17 AM Hi.... ios xcode compiler-errors share|improve this question edited Oct 29 '15 at 12:05 Eric Aya 34.2k116494 asked Aug 24 '15 at 7:21 testa abalez 3821315 add a comment| 6 Answers 6 active

Swiftc Failed With Exit Code 1 Xcode 7

In my case I had typed too fast and did: [seld method]; instead of: [self method]; Seriously! share|improve this answer edited Sep 2 '15 at 3:56 Dave Anderson 7,34913366 answered Nov 8 '14 at 0:04 jalagrange 1,19711322 1 LOL, happy to help :) –jalagrange Nov 9 '14 Xcodedefault.xctoolchain/usr/bin/swiftc Failed With Exit Code 1 Miles-Tone commented Sep 1, 2015 riiiiiiiight, so it didn't work before when i tried an empty project, but it does now. Xcodedefault.xctoolchain/usr/bin/clang Failed With Exit Code 1 Browse other questions tagged ios llvm or ask your own question.

Technically you can do git push on both your old project folder or the new one. check over here Pricing Hi, At the moment we're setting up a new and much better forum for you, so we can provide even better support! Member pizthewiz commented Sep 1, 2015 Yeah, it sounds like it might be best to pursue with ofxPD, but feel free to create a Gist of the failing build output and akien-mga closed this Feb 23, 2016 Sign up for free to join this conversation on GitHub. Apple Llvm 8.0 Error No Such File Or Directory

clang: error: linker command failed with exit code 1 ( Threads [ Previous | Next ] XCODE archive error. Sign in to comment Contact GitHub API Training Shop Blog About © 2016 GitHub, Inc. Showcases Showcases of partners and customers using Wikitude technology. his comment is here List all multiplicative partitions of n I feel like my encounters are too easy, even using the encounter tables Collatz Conjecture (3n+1) variant Brandenburg Concerto No. 5 in D: Why do

Was Judea as desertified 2000 years ago as it is now? Apple Llvm 6.0 Error No Such File Or Directory Convert a numeric string to number but without python's built in function more hot questions question feed default about us tour help blog chat data legal privacy policy work here advertising I hope this should help.

Here you go!

clang: error: linker command failed with exit code Answer 5/20/16 10:31 AM as a reply to budi nandang. Uploaded as 21396241. And ofc I looked for help in SO instead of use the common sense and check the error message. Apple Llvm 6.1 Error No Such File Or Directory Program arguments: /Applications/ -x objective-c++-header -arch arm64 -fmessage-length=0 -fdiagnostics-show-note-include-stack -fmacro-backtrace-limit=0 -std=c++11 -stdlib=libc++ ETC...... .....

drawing a regular hexagon In how many bits do I fit Why call it a "major" revision if the suggested changes are seemingly minor? Does this mean I'm stuck on an old version forever? And a picture to help you out: Hope this helps! Skip to content Ignore Learn more Please note that GitHub no longer supports old versions of Firefox.

If you try to do your include outside this condition this might be a cause of the compiler error. Member pizthewiz commented Sep 1, 2015 No worries, it sounds as though it might be a configuration issue then. im looking forward to getting better and being able to contribute properly instead of taking up peoples time :-/ thanks for the input! Is there a toy example of an axiomatically defined system/ structure?

Like Us on facebook SolutionMyself Copyright © 2015 MenuApple DeveloperApple DeveloperTechnologiesResourcesProgramsSupportMember CenterSearch Apple DeveloperSearch Apple DeveloperResetSearch Apple DeveloperApple Developer ForumsActivityHomeContentPeoplePlacesSearchSearch CommunitiesSearchLog in Apple Developer Forums / Xcode / Apple LLVM Apologies for the false flag!